Target
Carbonic anhydrase 12
Ligand
BDBM50250808
Substrate
Meas. Tech.
ChEBML_1523544
Temperature
298.15±n/a K
Ki
4.8±n/a nM
Comments
extracted
Citation
 Karioti, ACeruso, MCarta, FBilia, ARSupuran, CT New natural product carbonic anhydrase inhibitors incorporating phenol moieties. Bioorg Med Chem 23:7219-25 (2015)  
Target
Name:
Carbonic anhydrase 12
Synonyms:
CA-XII CAH12_HUMAN Carbonic anhydrase Carbonic anhydrase XII Carbonic anhydrase XII (CAXII) | Tumor antigen HOM-RCC-3.1.3
Type:
Enzyme
Mol. Mass.:
39456.00
Organism:
Homo sapiens (Human)
Description:
Catalytic domain of human cloned isozyme was used in the assay
Residue:
354
  
Inhibitor
Name:
BDBM50250808
Synonyms:
CHEMBL518243 | lithospermic acid
Type:
Small organic molecule
Emp. Form.:
C27H22O12
Mol. Mass.:
538.4564
SMILES:
OC(=O)[C@@H](Cc1ccc(O)c(O)c1)OC(=O)\C=C\c1ccc(O)c2O[C@@H]([C@@H](C(O)=O)c12)c1ccc(O)c(O)c1
: