Target
Bifunctional epoxide hydrolase 2
Ligand
BDBM50129686
Substrate
Meas. Tech.
ChEMBL_1523758 (CHEMBL3631996)
IC50
1.9±n/a nM
Citation
 Kim, IHPark, YKNishiwaki, HHammock, BDNishi, K Structure-activity relationships of amide-phosphonate derivatives as inhibitors of the human soluble epoxide hydrolase. Bioorg Med Chem 23:7199-210 (2015)  
Target
Name:
Bifunctional epoxide hydrolase 2
Synonyms:
Cytosolic epoxide hydrolase 2 EPHX2 HYES_HUMAN Soluble epoxide hydrolase (sEH) | epoxide hydrolase 2, cytoplasmic
Type:
Enzyme
Mol. Mass.:
62613.07
Organism:
Homo sapiens (Human)
Description:
P34913
Residue:
555
  
Inhibitor
Name:
BDBM50129686
Synonyms:
CHEMBL3629068
Type:
Small organic molecule
Emp. Form.:
C28H45N2O4P
Mol. Mass.:
504.6417
SMILES:
CCOP(=O)(OCC)C(Nc1ccc(CNC(=O)CC23CC4CC(CC(C4)C2)C3)cc1)C(C)(C)C
: