Target
Bifunctional epoxide hydrolase 2
Ligand
BDBM50129708
Substrate
Meas. Tech.
ChEMBL_1523758 (CHEMBL3631996)
IC50
46±n/a nM
Citation
 Kim, IHPark, YKNishiwaki, HHammock, BDNishi, K Structure-activity relationships of amide-phosphonate derivatives as inhibitors of the human soluble epoxide hydrolase. Bioorg Med Chem 23:7199-210 (2015)  
Target
Name:
Bifunctional epoxide hydrolase 2
Synonyms:
Cytosolic epoxide hydrolase 2 EPHX2 HYES_HUMAN Soluble epoxide hydrolase (sEH) | epoxide hydrolase 2, cytoplasmic
Type:
Enzyme
Mol. Mass.:
62613.07
Organism:
Homo sapiens (Human)
Description:
P34913
Residue:
555
  
Inhibitor
Name:
BDBM50129708
Synonyms:
CHEMBL3628767
Type:
Small organic molecule
Emp. Form.:
C29H45N2O4P
Mol. Mass.:
516.6524
SMILES:
CCOP(=O)(OCC)C(Nc1ccc(CNC(=O)C23CC4CC(CC(C4)C2)C3)cc1)C1CCCCC1
: