Target
Acetylcholinesterase
Ligand
BDBM10620
Substrate
Meas. Tech.
ChEMBL_1525143 (CHEMBL3635481)
IC50
54±n/a nM
Citation
 Al-Rashid, ZFHsung, RP A computational view on the significance of E-ring in binding of (+)-arisugacin A to acetylcholinesterase. Bioorg Med Chem Lett 25:4848-53 (2015)  
Target
Name:
Acetylcholinesterase
Synonyms:
ACES_HUMAN Acetylcholinesterase (AChE) | Acetylcholinesterase (human AChE)
Type:
Enzyme
Mol. Mass.:
67792.70
Organism:
Homo sapiens (Human)
Description:
P22303
Residue:
614
  
Inhibitor
Name:
BDBM10620
Synonyms:
(S)-3-(1-(dimethylamino)ethyl)phenyl ethyl(methyl)carbamate 3-(1-(dimethylamino)ethyl)phenyl ethyl(methyl)carbamate CHEMBL636 Ethyl-methyl-carbamic acid 3-((R)-1-dimethylamino-ethyl)-phenyl ester Ethyl-methyl-carbamic acid 3-(1-dimethylamino-ethyl)-phenyl ester Rivastigmine SDZ-212-713 | SDZ-ENA-713
Type:
Small organic molecule
Emp. Form.:
C14H22N2O2
Mol. Mass.:
250.3367
SMILES:
[H][C@@](C)(N(C)C)c1cccc(OC(=O)N(C)CC)c1
: