Target
Acetylcholinesterase
Ligand
BDBM50130204
Substrate
Meas. Tech.
ChEMBL_1525144 (CHEMBL3635482)
IC50
6.8±n/a nM
Citation
 Al-Rashid, ZFHsung, RP A computational view on the significance of E-ring in binding of (+)-arisugacin A to acetylcholinesterase. Bioorg Med Chem Lett 25:4848-53 (2015)  
Target
Name:
Acetylcholinesterase
Synonyms:
ACES_HUMAN Acetylcholinesterase (AChE) | Acetylcholinesterase (human AChE)
Type:
Enzyme
Mol. Mass.:
67792.70
Organism:
Homo sapiens (Human)
Description:
P22303
Residue:
614
  
Inhibitor
Name:
BDBM50130204
Synonyms:
CHEMBL3632858
Type:
Small organic molecule
Emp. Form.:
C28H32O9
Mol. Mass.:
512.5483
SMILES:
COc1cc(cc(OC)c1O)-c1cc2O[C@]3(C)CC[C@@]4(O)C(C)(C)C=CC(=O)[C@]4(C)[C@@]3(O)Cc2c(=O)o1
: