Target
5-hydroxytryptamine receptor 1D
Ligand
BDBM50060440
Substrate
Meas. Tech.
ChEMBL_1525150 (CHEMBL3635488)
IC50
0.140000±n/a nM
Citation
 Gillis, EPEastman, KJHill, MDDonnelly, DJMeanwell, NA Applications of Fluorine in Medicinal Chemistry. J Med Chem 58:8315-59 (2015)  
Target
Name:
5-hydroxytryptamine receptor 1D
Synonyms:
5-HT-1D 5-HT1D 5HT1D_HUMAN HTR1DA Serotonin (5-HT) receptor | Serotonin Receptor 1D
Type:
G Protein-Coupled Receptor (GPCR)
Mol. Mass.:
41920.63
Organism:
Homo sapiens (Human)
Description:
Receptor binding assays were performed using human clone stably expressed in CHO cells.
Residue:
377
  
Inhibitor
Name:
BDBM50060440
Synonyms:
3-[3-(4-Benzyl-piperazin-1-yl)-propyl]-5-[1,2,4]triazol-4-yl-1H-indole | CHEMBL65367
Type:
Small organic molecule
Emp. Form.:
C24H28N6
Mol. Mass.:
400.5193
SMILES:
C(CN1CCN(Cc2ccccc2)CC1)Cc1c[nH]c2ccc(cc12)-n1cnnc1
: