Target
Prothrombin
Ligand
BDBM50123504
Substrate
Meas. Tech.
ChEMBL_1525158 (CHEMBL3635496)
Ki
0.100000±n/a nM
Citation
 Gillis, EPEastman, KJHill, MDDonnelly, DJMeanwell, NA Applications of Fluorine in Medicinal Chemistry. J Med Chem 58:8315-59 (2015)  
Target
Name:
Prothrombin
Synonyms:
Activation peptide fragment 1 Coagulation factor II Prothrombin precursor Thrombin heavy chain | Thrombin light chain
Type:
Protein
Mol. Mass.:
70029.57
Organism:
Homo sapiens (Human)
Description:
P00734
Residue:
622
  
Inhibitor
Name:
BDBM50123504
Synonyms:
CHEMBL142546 N-(6-Amino-2-methyl-pyridin-3-ylmethyl)-2-[3-(2,2-difluoro-2-phenyl-ethylamino)-6-methyl-2-oxo-2H-pyrazin-1-yl]-acetamide
Type:
Small organic molecule
Emp. Form.:
C22H24F2N6O2
Mol. Mass.:
442.4618
SMILES:
Cc1cnc(NCC(F)(F)c2ccccc2)c(=O)n1CC(=O)NCc1ccc(N)nc1C
: