Target
Kelch-like ECH-associated protein 1
Ligand
BDBM50006931
Substrate
Meas. Tech.
ChEMBL_1525531 (CHEMBL3637038)
IC50
1700±n/a nM
Citation
 Jain, ADPotteti, HRichardson, BGKingsley, LLuciano, JPRyuzoji, AFLee, HKrunic, AMesecar, ADReddy, SPMoore, TW Probing the structural requirements of non-electrophilic naphthalene-based Nrf2 activators. Eur J Med Chem 103:252-68 (2015)  
Target
Name:
Kelch-like ECH-associated protein 1
Synonyms:
Cytosolic inhibitor of Nrf2 KEAP1 KEAP1_HUMAN KLHL19 | Kelch-like protein 19
Type:
PROTEIN
Mol. Mass.:
69664.53
Organism:
Homo sapiens (Human)
Description:
ChEMBL_107924
Residue:
624
  
Inhibitor
Name:
BDBM50006931
Synonyms:
CHEMBL2402207
Type:
Small organic molecule
Emp. Form.:
C24H22N2O6S2
Mol. Mass.:
498.571
SMILES:
COc1ccc(cc1)S(=O)(=O)Nc1ccc(NS(=O)(=O)c2ccc(OC)cc2)c2ccccc12
: