Target
Carbonic anhydrase 12
Ligand
BDBM50130742
Substrate
Meas. Tech.
ChEMBL_1524850 (CHEMBL3636832)
Ki
83±n/a nM
Citation
 Ibrahim, HSAbou-Seri, SMTanc, MElaasser, MMAbdel-Aziz, HASupuran, CT Isatin-pyrazole benzenesulfonamide hybrids potently inhibit tumor-associated carbonic anhydrase isoforms IX and XII. Eur J Med Chem 103:583-93 (2015)  
Target
Name:
Carbonic anhydrase 12
Synonyms:
CA-XII CAH12_HUMAN Carbonic anhydrase Carbonic anhydrase XII Carbonic anhydrase XII (CAXII) | Tumor antigen HOM-RCC-3.1.3
Type:
Enzyme
Mol. Mass.:
39456.00
Organism:
Homo sapiens (Human)
Description:
Catalytic domain of human cloned isozyme was used in the assay
Residue:
354
  
Inhibitor
Name:
BDBM50130742
Synonyms:
CHEMBL3633552
Type:
Small organic molecule
Emp. Form.:
C19H17N7O5S
Mol. Mass.:
455.447
SMILES:
COc1ccc2NC(=O)\C(=N/NC(=O)c3cnn(c3N)-c3ccc(cc3)S(N)(=O)=O)c2c1
: