Target
Carbonic anhydrase 2
Ligand
BDBM50130743
Substrate
Meas. Tech.
ChEMBL_1524848 (CHEMBL3636830)
Ki
23±n/a nM
Citation
 Ibrahim, HSAbou-Seri, SMTanc, MElaasser, MMAbdel-Aziz, HASupuran, CT Isatin-pyrazole benzenesulfonamide hybrids potently inhibit tumor-associated carbonic anhydrase isoforms IX and XII. Eur J Med Chem 103:583-93 (2015)  
Target
Name:
Carbonic anhydrase 2
Synonyms:
CA-II CAC Carbonate dehydratase II Carbonic anhydrase 2 (CA-II) Carbonic anhydrase C Carbonic anhydrase II (CA-II) Carbonic anhydrase II (hCA II) | Carbonic anhydrase isoenzyme II (hCA II)
Type:
Enzyme
Mol. Mass.:
29250.71
Organism:
Homo sapiens (Human)
Description:
P00918
Residue:
260
  
Inhibitor
Name:
BDBM50130743
Synonyms:
CHEMBL3633553
Type:
Small organic molecule
Emp. Form.:
C18H14N8O6S
Mol. Mass.:
470.419
SMILES:
Nc1c(cnn1-c1ccc(cc1)S(N)(=O)=O)C(=O)N\N=C1/C(=O)Nc2ccc(cc12)[N+]([O-])=O
: