Target
Carbonic anhydrase 9
Ligand
BDBM50130736
Substrate
Meas. Tech.
ChEMBL_1524849 (CHEMBL3636831)
Ki
3.3±n/a nM
Citation
 Ibrahim, HSAbou-Seri, SMTanc, MElaasser, MMAbdel-Aziz, HASupuran, CT Isatin-pyrazole benzenesulfonamide hybrids potently inhibit tumor-associated carbonic anhydrase isoforms IX and XII. Eur J Med Chem 103:583-93 (2015)  
Target
Name:
Carbonic anhydrase 9
Synonyms:
CA-IX CAH9_HUMAN Carbonic anhydrase 9 (CA IX) Carbonic anhydrase 9 precursor Carbonic anhydrase IX (CAIX) Carbonic anhydrases; II & IX MN RCC-associated antigen G250
Type:
Enzyme
Mol. Mass.:
49669.03
Organism:
Homo sapiens (Human)
Description:
Catalytic domain of human cloned isozyme was used in the assay
Residue:
459
  
Inhibitor
Name:
BDBM50130736
Synonyms:
CHEMBL3633386
Type:
Small organic molecule
Emp. Form.:
C25H20N6O5S
Mol. Mass.:
516.529
SMILES:
COc1ccc2NC(=O)\C(=N/NC(=O)c3cnn(c3-c3ccccc3)-c3ccc(cc3)S(N)(=O)=O)c2c1
: