Target
Carbonic anhydrase 12
Ligand
BDBM50130746
Substrate
Meas. Tech.
ChEMBL_1524850 (CHEMBL3636832)
Ki
91±n/a nM
Citation
 Ibrahim, HSAbou-Seri, SMTanc, MElaasser, MMAbdel-Aziz, HASupuran, CT Isatin-pyrazole benzenesulfonamide hybrids potently inhibit tumor-associated carbonic anhydrase isoforms IX and XII. Eur J Med Chem 103:583-93 (2015)  
Target
Name:
Carbonic anhydrase 12
Synonyms:
CA-XII CAH12_HUMAN Carbonic anhydrase Carbonic anhydrase XII Carbonic anhydrase XII (CAXII) | Tumor antigen HOM-RCC-3.1.3
Type:
Enzyme
Mol. Mass.:
39456.00
Organism:
Homo sapiens (Human)
Description:
Catalytic domain of human cloned isozyme was used in the assay
Residue:
354
  
Inhibitor
Name:
BDBM50130746
Synonyms:
CHEMBL3633385
Type:
Small organic molecule
Emp. Form.:
C24H17BrN6O4S
Mol. Mass.:
565.399
SMILES:
NS(=O)(=O)c1ccc(cc1)-n1ncc(C(=O)N\N=C2/C(=O)Nc3ccc(Br)cc23)c1-c1ccccc1
: