Target
Carbonic anhydrase 2
Ligand
BDBM50130737
Substrate
Meas. Tech.
ChEMBL_1524848 (CHEMBL3636830)
Ki
31±n/a nM
Citation
 Ibrahim, HSAbou-Seri, SMTanc, MElaasser, MMAbdel-Aziz, HASupuran, CT Isatin-pyrazole benzenesulfonamide hybrids potently inhibit tumor-associated carbonic anhydrase isoforms IX and XII. Eur J Med Chem 103:583-93 (2015)  
Target
Name:
Carbonic anhydrase 2
Synonyms:
CA-II CAC Carbonate dehydratase II Carbonic anhydrase 2 (CA-II) Carbonic anhydrase C Carbonic anhydrase II (CA-II) Carbonic anhydrase II (hCA II) | Carbonic anhydrase isoenzyme II (hCA II)
Type:
Enzyme
Mol. Mass.:
29250.71
Organism:
Homo sapiens (Human)
Description:
P00918
Residue:
260
  
Inhibitor
Name:
BDBM50130737
Synonyms:
CHEMBL3633547
Type:
Small organic molecule
Emp. Form.:
C24H17N7O6S
Mol. Mass.:
531.5
SMILES:
NS(=O)(=O)c1ccc(cc1)-n1ncc(C(=O)N\N=C2/C(=O)Nc3ccc(cc23)[N+]([O-])=O)c1-c1ccccc1
: