Target
Urokinase-type plasminogen activator
Ligand
BDBM50100897
Substrate
Meas. Tech.
ChEMBL_1525567 (CHEMBL3637193)
Ki
5500±n/a nM
Citation
 Goswami, RWohlfahrt, GTörmäkangas, OMoilanen, ALakshminarasimhan, ANagaraj, JArumugam, KNMukherjee, SChacko, ARKrishnamurthy, NRJaleel, MPalakurthy, RKSamiulla, DSRamachandra, M Structure-guided discovery of 2-aryl/pyridin-2-yl-1H-indole derivatives as potent and selective hepsin inhibitors. Bioorg Med Chem Lett 25:5309-14 (2015)  
Target
Name:
Urokinase-type plasminogen activator
Synonyms:
PLAU UROK_HUMAN Urokinase-type plasminogen activator (uPA) | Urokinase-type plasminogen activator/surface receptor
Type:
Enzyme
Mol. Mass.:
48528.62
Organism:
Homo sapiens (Human)
Description:
P00749
Residue:
431
  
Inhibitor
Name:
BDBM50100897
Synonyms:
2-(2-Hydroxy-phenyl)-1H-benzoimidazole-5-carboxamidine 2-{5-[AMINO(IMINIO)METHYL]-1H-BENZIMIDAZOL-2-YL}BENZENOLATE | CHEMBL433501
Type:
Small organic molecule
Emp. Form.:
C14H12N4O
Mol. Mass.:
252.2713
SMILES:
NC(=N)c1ccc2nc([nH]c2c1)-c1ccccc1O
: