Target
P2Y purinoceptor 1
Ligand
BDBM50131062
Substrate
Meas. Tech.
ChEMBL_1526464 (CHEMBL3637733)
EC50
880±n/a nM
Citation
 Azran, SDanino, OFörster, DKenigsberg, SReiser, GDixit, MSingh, VMajor, DTFischer, B Identification of Highly Promising Antioxidants/Neuroprotectants Based on Nucleoside 5'-Phosphorothioate Scaffold. Synthesis, Activity, and Mechanisms of Action. J Med Chem 58:8427-43 (2015)  
Target
Name:
P2Y purinoceptor 1
Synonyms:
ATP receptor P2RY1_HUMAN P2Y1 Purinergic receptor P2Y1
Type:
Enzyme
Mol. Mass.:
42090.25
Organism:
Homo sapiens (Human)
Description:
P47900
Residue:
373
  
Inhibitor
Name:
BDBM50131062
Synonyms:
CHEMBL3634184
Type:
Small organic molecule
Emp. Form.:
C10H15ClN5O12P3S
Mol. Mass.:
557.692
SMILES:
Nc1nc(Cl)nc2n(cnc12)[C@@H]1O[C@H](COP(S)(=O)OP(O)(=O)OP(O)(O)=O)[C@@H](O)[C@H]1O
: