Target
X-box-binding protein 1
Ligand
BDBM50131223
Substrate
Meas. Tech.
ChEBML_1526682
EC50
80±n/a nM
Citation
 Ren, JWang, YGWang, AGWu, LQZhang, HJWang, WJSu, YLQin, HL Cembranoids from the Gum Resin of Boswellia carterii as Potential Antiulcerative Colitis Agents. J Nat Prod 78:2322-31 (2015)  
Target
Name:
X-box-binding protein 1
Synonyms:
Hepatocarcinogenesis-related transcription factor X-box-binding protein 1 X-box-binding protein 1, luminal form Xbp1
Type:
PROTEIN
Mol. Mass.:
29677.58
Organism:
Rattus norvegicus
Description:
ChEMBL_109918
Residue:
267
  
Inhibitor
Name:
BDBM50131223
Synonyms:
CHEMBL3612189
Type:
Small organic molecule
Emp. Form.:
C19H13NO5
Mol. Mass.:
335.3102
SMILES:
O=c1n2CCc3cc4OCOc4cc3-c2cc2ccc3OCOc3c12
: