Target
Carbonic anhydrase 12
Ligand
BDBM50259746
Substrate
Meas. Tech.
ChEMBL_1523558 (CHEMBL3631206)
Ki
8470±n/a nM
Citation
 Maresca, AAkyuz, GOsman, SMAlOthman, ZSupuran, CT Inhibition of mammalian carbonic anhydrase isoforms I-XIV with a series of phenolic acid esters. Bioorg Med Chem 23:7181-8 (2015)  
Target
Name:
Carbonic anhydrase 12
Synonyms:
CA-XII CAH12_HUMAN Carbonic anhydrase Carbonic anhydrase XII Carbonic anhydrase XII (CAXII) | Tumor antigen HOM-RCC-3.1.3
Type:
Enzyme
Mol. Mass.:
39456.00
Organism:
Homo sapiens (Human)
Description:
Catalytic domain of human cloned isozyme was used in the assay
Residue:
354
  
Inhibitor
Name:
BDBM50259746
Synonyms:
(4-Hydroxyphenyl)ethyl trans-ferulate p-Hydroxyphenethyl trans-ferulate (18) | p-hydroxyphenethyl trans-ferulate
Type:
Small organic molecule
Emp. Form.:
C18H18O5
Mol. Mass.:
314.3325
SMILES:
COc1cc(\C=C\C(=O)OCCc2ccc(O)cc2)ccc1O
: