Target
Carbonic anhydrase 3
Ligand
BDBM50131680
Substrate
Meas. Tech.
ChEMBL_1523551 (CHEMBL3631199)
Ki
>50000±n/a nM
Citation
 Maresca, AAkyuz, GOsman, SMAlOthman, ZSupuran, CT Inhibition of mammalian carbonic anhydrase isoforms I-XIV with a series of phenolic acid esters. Bioorg Med Chem 23:7181-8 (2015)  
Target
Name:
Carbonic anhydrase 3
Synonyms:
CA-III CAH3_HUMAN Carbonic Anhydrase III Carbonic anhydrase 3 (CA III) | Carbonic anhydrase III (CA III)
Type:
Enzyme
Mol. Mass.:
29562.11
Organism:
Homo sapiens (Human)
Description:
Human cloned isozyme.
Residue:
260
  
Inhibitor
Name:
BDBM50131680
Synonyms:
CHEMBL3628212
Type:
Small organic molecule
Emp. Form.:
C17H16O4
Mol. Mass.:
284.3065
SMILES:
Oc1ccc(\C=C\C(=O)OCCc2cccc(O)c2)cc1
: