Target
Acetylcholinesterase
Ligand
BDBM50131767
Substrate
Meas. Tech.
ChEMBL_1525849 (CHEMBL3635763)
IC50
2150±n/a nM
Citation
 Mostofi, MMohammadi Ziarani, GMahdavi, MMoradi, ANadri, HEmami, SAlinezhad, HForoumadi, AShafiee, A Synthesis and structure-activity relationship study of benzofuran-based chalconoids bearing benzylpyridinium moiety as potent acetylcholinesterase inhibitors. Eur J Med Chem 103:361-9 (2015)  
Target
Name:
Acetylcholinesterase
Synonyms:
3.1.1.7 Acetylcholinesterase (AChE) ache
Type:
Mol. Mass.:
65900.74
Organism:
Tetronarce californica (Pacific electric ray) (Torpedo californica)
Description:
P04058
Residue:
586
  
Inhibitor
Name:
BDBM50131767
Synonyms:
CHEMBL3633860
Type:
Small organic molecule
Emp. Form.:
C23H16Br3NO2
Mol. Mass.:
578.091
SMILES:
[Br-].Brc1ccc2oc(cc2c1)C(=O)\C=C\c1ccc[n+](Cc2ccccc2Br)c1
: