Target
Nuclear receptor ROR-gamma
Ligand
BDBM50132475
Substrate
Meas. Tech.
ChEMBL_1526208 (CHEMBL3636893)
IC50
26±n/a nM
Citation
 Abdel-Magid, AF RORc Modulators for the Treatment of Autoimmune Diseases. ACS Med Chem Lett 6:958-60 (2015)  
Target
Name:
Nuclear receptor ROR-gamma
Synonyms:
NR1F3 Nuclear receptor ROR-gamma (RORC) RAR-related orphan receptor C (RORc) RORG RZRG Retinoid-related orphan receptor-gamma (RORc)
Type:
Enzyme Catalytic Domain
Mol. Mass.:
58218.40
Organism:
Homo sapiens (Human)
Description:
P51449
Residue:
518
  
Inhibitor
Name:
BDBM50132475
Synonyms:
CHEMBL3634612 | US9751873, Example 67
Type:
Small organic molecule
Emp. Form.:
C25H28F3N5O2S
Mol. Mass.:
519.582
SMILES:
FC(F)[C@H]1CC[C@H](c2ccccc2)S(=O)(=O)N1Cc1ccc(cc1F)N1CCC(CC1)n1cnnc1
: