Target
Receptor-type tyrosine-protein phosphatase S
Ligand
BDBM50131836
Substrate
Meas. Tech.
ChEMBL_1526440 (CHEMBL3637709)
IC50
600±n/a nM
Citation
 Haftchenary, SJouk, AOAubry, ILewis, AMLandry, MBall, DPShouksmith, AECollins, CVTremblay, MLGunning, PT Identification of Bidentate Salicylic Acid Inhibitors of PTP1B. ACS Med Chem Lett 6:982-6 (2015)  
Target
Name:
Receptor-type tyrosine-protein phosphatase S
Synonyms:
PTPRS R-PTP-S Receptor-type tyrosine-protein phosphatase S | Receptor-type tyrosine-protein phosphatase sigma
Type:
PROTEIN
Mol. Mass.:
217036.26
Organism:
Homo sapiens (Human)
Description:
ChEMBL_107614
Residue:
1948
  
Inhibitor
Name:
BDBM50131836
Synonyms:
CHEMBL3633138
Type:
Small organic molecule
Emp. Form.:
C46H47N7O10S
Mol. Mass.:
889.971
SMILES:
OC(=O)c1ccc(NC(=O)CCCCn2cc(CN(CC(=O)N(Cc3ccc(cc3)C3CCCCC3)c3ccc(C(O)=O)c(O)c3)S(=O)(=O)c3cccc4cccnc34)nn2)cc1O
: