Target
Tyrosine-protein kinase JAK3
Ligand
BDBM50131843
Substrate
Meas. Tech.
ChEMBL_1526613 (CHEMBL3635832)
Kd
30±n/a nM
Citation
 Wurz, RPPettus, LHAshton, KBrown, JChen, JJHerberich, BHong, FTHu-Harrington, ENguyen, TSt Jean, DJTadesse, SBauer, DKubryk, MZhan, JCooke, KMitchell, PAndrews, KLHsieh, FHickman, DKalyanaraman, NWu, TReid, DLLobenhofer, EKAndrews, DAEverds, NGuzman, RParsons, ATHedley, SJTedrow, JThiel, ORPotter, MRadinsky, RBeltran, PJTasker, AS Oxopyrido[2,3-d]pyrimidines as Covalent L858R/T790M Mutant Selective Epidermal Growth Factor Receptor (EGFR) Inhibitors. ACS Med Chem Lett 6:987-92 (2015)  
Target
Name:
Tyrosine-protein kinase JAK3
Synonyms:
JAK-3 JAK3_HUMAN Janus kinase 3 (JAK3) L-JAK | Leukocyte janus kinase
Type:
Protein
Mol. Mass.:
125111.08
Organism:
Homo sapiens (Human)
Description:
P52333
Residue:
1124
  
Inhibitor
Name:
BDBM50131843
Synonyms:
CHEMBL3633152
Type:
Small organic molecule
Emp. Form.:
C28H30N6O4
Mol. Mass.:
514.5756
SMILES:
COc1cc(OCCN(C)C)ccc1Nc1ncc2c(C)cc(=O)n(-c3cccc(NC(=O)C=C)c3)c2n1
: