Target
Kinesin-like protein KIF11
Ligand
BDBM50382559
Substrate
Meas. Tech.
ChEMBL_1526764 (CHEMBL3636399)
IC50
47±n/a nM
Citation
 Ogo, NIshikawa, YSawada, JMatsuno, KHashimoto, AAsai, A Structure-Guided Design of Novel l-Cysteine Derivatives as Potent KSP Inhibitors. ACS Med Chem Lett 6:1004-9 (2015)  
Target
Name:
Kinesin-like protein KIF11
Synonyms:
EG5 KIF11_HUMAN Kinesin Spindle Protein Eg5 TRIP5 | kinesin spindle protein
Type:
PROTEIN
Mol. Mass.:
119138.97
Organism:
Homo sapiens (Human)
Description:
ChEMBL_1457426
Residue:
1056
  
Inhibitor
Name:
BDBM50382559
Synonyms:
ISPINESIB
Type:
Small organic molecule
Emp. Form.:
C30H33ClN4O2
Mol. Mass.:
517.062
SMILES:
CC(C)[C@@H](N(CCCN)C(=O)c1ccc(C)cc1)c1nc2cc(Cl)ccc2c(=O)n1Cc1ccccc1
: