Target
Probable G-protein coupled receptor 139
Ligand
BDBM50131900
Substrate
Meas. Tech.
ChEMBL_1526933 (CHEMBL3637279)
EC50
>10000±n/a nM
Citation
 Dvorak, CACoate, HNepomuceno, DWennerholm, MKuei, CLord, BWoody, DBonaventure, PLiu, CLovenberg, TCarruthers, NI Identification and SAR of Glycine Benzamides as Potent Agonists for the GPR139 Receptor. ACS Med Chem Lett 6:1015-8 (2015)  
Target
Name:
Probable G-protein coupled receptor 139
Synonyms:
G(q)-coupled orphan receptor GPRg1 G-protein-coupled receptor PGR3 GPR139 GPRG1 Probable G-protein coupled receptor 139
Type:
PROTEIN
Mol. Mass.:
40700.34
Organism:
Homo sapiens (Human)
Description:
ChEMBL_109920
Residue:
353
  
Inhibitor
Name:
BDBM50131900
Synonyms:
CHEMBL3633892
Type:
Small organic molecule
Emp. Form.:
C17H19ClN2O
Mol. Mass.:
302.799
SMILES:
C[C@H](NC(=O)CNCc1cccc(Cl)c1)c1ccccc1
: