Target
Metabotropic glutamate receptor 1
Ligand
BDBM50132800
Substrate
Meas. Tech.
ChEMBL_1525064 (CHEMBL3635102)
EC50
16±n/a nM
Citation
 Garcia-Barrantes, PMCho, HPBlobaum, ALNiswender, CMConn, PJLindsley, CW Lead optimization of the VU0486321 series of mGlu1 PAMs. Part 1: SAR of modifications to the central aryl core. Bioorg Med Chem Lett 25:5107-10 (2015)  
Target
Name:
Metabotropic glutamate receptor 1
Synonyms:
GPRC1A GRM1_HUMAN Metabotropic Glutamate 1a | metabotropic glutamate 1
Type:
Enzyme
Mol. Mass.:
132358.19
Organism:
Homo sapiens (Human)
Description:
Q13255
Residue:
1194
  
Inhibitor
Name:
BDBM50132800
Synonyms:
CHEMBL3634442
Type:
Small organic molecule
Emp. Form.:
C25H18N2O4
Mol. Mass.:
410.4214
SMILES:
Cc1ccoc1C(=O)Nc1ccc(N2C(=O)c3cccc(C)c3C2=O)c2ccccc12
: