Target
Metabotropic glutamate receptor 1
Ligand
BDBM50132774
Substrate
Meas. Tech.
ChEMBL_1525064 (CHEMBL3635102)
IC50
47±n/a nM
Citation
 Garcia-Barrantes, PMCho, HPBlobaum, ALNiswender, CMConn, PJLindsley, CW Lead optimization of the VU0486321 series of mGlu1 PAMs. Part 1: SAR of modifications to the central aryl core. Bioorg Med Chem Lett 25:5107-10 (2015)  
Target
Name:
Metabotropic glutamate receptor 1
Synonyms:
GPRC1A GRM1_HUMAN Metabotropic Glutamate 1a | metabotropic glutamate 1
Type:
Enzyme
Mol. Mass.:
132358.19
Organism:
Homo sapiens (Human)
Description:
Q13255
Residue:
1194
  
Inhibitor
Name:
BDBM50132774
Synonyms:
CHEMBL3634430
Type:
Small organic molecule
Emp. Form.:
C21H16N2O5
Mol. Mass.:
376.3621
SMILES:
COc1cc(NC(=O)c2occc2C)ccc1N1C(=O)c2ccccc2C1=O
: