Target
TGF-beta receptor type-1
Ligand
BDBM50298220
Substrate
Meas. Tech.
ChEMBL_1525276 (CHEMBL3635885)
IC50
668±n/a nM
Citation
 Krishnaiah, MJin, CHSheen, YYKim, DK Synthesis and biological evaluation of 5-(fluoro-substituted-6-methylpyridin-2-yl)-4-([1,2,4]triazolo[1,5-a]pyridin-6-yl)imidazoles as inhibitors of transforming growth factor-ß type I receptor kinase. Bioorg Med Chem Lett 25:5228-31 (2015)  
Target
Name:
TGF-beta receptor type-1
Synonyms:
ALK-5 Activin A receptor type II-like protein kinase of 53kD SKR4 TGF-beta receptor type I TGFBR1 TGFR1_HUMAN Transforming growth factor-beta receptor type I
Type:
enzyme
Mol. Mass.:
55968.24
Organism:
Homo sapiens (Human)
Description:
P36897
Residue:
503
  
Inhibitor
Name:
BDBM50298220
Synonyms:
2-(4-(benzo[d][1,3]dioxol-5-yl)-2-tert-butyl-1H-imidazol-5-yl)-6-methylpyridine CHEMBL1824446 SB-505124 | US11759530, Compound Table1.2
Type:
Small organic molecule
Emp. Form.:
C20H21N3O2
Mol. Mass.:
335.3996
SMILES:
Cc1cccc(n1)-c1nc([nH]c1-c1ccc2OCOc2c1)C(C)(C)C
: