Target
Lysine-specific demethylase 4A
Ligand
BDBM50133271
Substrate
Meas. Tech.
ChEMBL_1525596 (CHEMBL3637222)
IC50
50000±n/a nM
Citation
 Feng, TLi, DWang, HZhuang, JLiu, FBao, QLei, YChen, WZhang, XXu, XSun, HYou, QGuo, X Novel 5-carboxy-8-HQ based histone demethylase JMJD2A inhibitors: introduction of an additional carboxyl group at the C-2 position of quinoline. Eur J Med Chem 105:145-55 (2015)  
Target
Name:
Lysine-specific demethylase 4A
Synonyms:
JHDM3A JMJD2A Jumonji domain-containing protein 2A KDM4A_HUMAN Lysine-specific demethylase 4A | Lysine-specific demethylase 4A (KDM4A)
Type:
Enzyme
Mol. Mass.:
120647.83
Organism:
Homo sapiens (Human)
Description:
O75164
Residue:
1064
  
Inhibitor
Name:
BDBM50133271
Synonyms:
CHEMBL3634954
Type:
Small organic molecule
Emp. Form.:
C17H18N2O4
Mol. Mass.:
314.3358
SMILES:
CN1CCC(CC1)C(=O)c1ccc2c(ccc(O)c2n1)C(O)=O
: