Target
Mucosa-associated lymphoid tissue lymphoma translocation protein 1
Ligand
BDBM50133351
Substrate
Meas. Tech.
ChEMBL_1525781 (CHEMBL3635350)
IC50
2300±n/a nM
Citation
 Lim, SMJeong, YLee, SIm, HTae, HSKim, BGPark, HDPark, JHong, S Identification of฿-Lapachone Analogs as Novel MALT1 Inhibitors To Treat an Aggressive Subtype of Diffuse Large B-Cell Lymphoma. J Med Chem 58:8491-502 (2015)  
Target
Name:
Mucosa-associated lymphoid tissue lymphoma translocation protein 1
Synonyms:
MALT lymphoma-associated translocation MALT1 MLT Paracaspase
Type:
Enzyme
Mol. Mass.:
92257.81
Organism:
Homo sapiens (Human)
Description:
Q9UDY8
Residue:
824
  
Inhibitor
Name:
BDBM50133351
Synonyms:
CHEMBL177685
Type:
Small organic molecule
Emp. Form.:
C17H18O5
Mol. Mass.:
302.3218
SMILES:
COc1cc2C(=O)C(=O)C3=C(OC(C)(C)CC3)c2cc1OC
: