Target
G-protein coupled receptor family C group 6 member A
Ligand
BDBM50133681
Substrate
Meas. Tech.
ChEMBL_1526359 (CHEMBL3637420)
IC50
21380±n/a nM
Citation
 Johansson, HBoesgaard, MWNørskov-Lauritsen, LLarsen, IKuhne, SGloriam, DEBräuner-Osborne, HSejer Pedersen, D Selective Allosteric Antagonists for the G Protein-Coupled Receptor GPRC6A Based on the 2-Phenylindole Privileged Structure Scaffold. J Med Chem 58:8938-51 (2015)  
Target
Name:
G-protein coupled receptor family C group 6 member A
Synonyms:
G-protein coupled receptor family C group 6 member A Gprc6a
Type:
PROTEIN
Mol. Mass.:
104230.70
Organism:
Mus musculus
Description:
ChEMBL_109502
Residue:
928
  
Inhibitor
Name:
BDBM50133681
Synonyms:
CHEMBL3633655
Type:
Small organic molecule
Emp. Form.:
C23H24FN3O3
Mol. Mass.:
409.4534
SMILES:
CN(CC(=O)N1CCOCC1)CC(=O)c1c([nH]c2ccccc12)-c1ccc(F)cc1
: