Target
G-protein coupled receptor family C group 6 member A
Ligand
BDBM50133682
Substrate
Meas. Tech.
ChEMBL_1526359 (CHEMBL3637420)
IC50
9333±n/a nM
Citation
 Johansson, HBoesgaard, MWNørskov-Lauritsen, LLarsen, IKuhne, SGloriam, DEBräuner-Osborne, HSejer Pedersen, D Selective Allosteric Antagonists for the G Protein-Coupled Receptor GPRC6A Based on the 2-Phenylindole Privileged Structure Scaffold. J Med Chem 58:8938-51 (2015)  
Target
Name:
G-protein coupled receptor family C group 6 member A
Synonyms:
G-protein coupled receptor family C group 6 member A Gprc6a
Type:
PROTEIN
Mol. Mass.:
104230.70
Organism:
Mus musculus
Description:
ChEMBL_109502
Residue:
928
  
Inhibitor
Name:
BDBM50133682
Synonyms:
CHEMBL3633656
Type:
Small organic molecule
Emp. Form.:
C24H27N3O4
Mol. Mass.:
421.4889
SMILES:
COc1ccc(cc1)-c1[nH]c2ccccc2c1C(=O)CN(C)CC(=O)N1CCOCC1
: