Target
Dual specificity calcium/calmodulin-dependent 3',5'-cyclic nucleotide phosphodiesterase 1B
Ligand
BDBM50134222
Substrate
Meas. Tech.
ChEBML_1542835
IC50
>1000±n/a nM
Citation
 Wagner, SScheunemann, MDipper, KEgerland, UHoefgen, NSteinbach, JBrust, P Development of highly potent phosphodiesterase 10A (PDE10A) inhibitors: Synthesis and in vitro evaluation of 1,8-dipyridinyl- and 1-pyridinyl-substituted imidazo[1,5-a]quinoxalines. Eur J Med Chem 107:97-108 (2015)  
Target
Name:
Dual specificity calcium/calmodulin-dependent 3',5'-cyclic nucleotide phosphodiesterase 1B
Synonyms:
63 kDa Cam-PDE Calcium/calmodulin-dependent 3',5'-cyclic nucleotide phosphodiesterase 1B PDE1B PDE1B_HUMAN Phosphodiesterase 1B Phosphodiesterase Type 1 (PDE1B) | Phosphodiesterase, PDE1/PDE5
Type:
Enzyme
Mol. Mass.:
61366.51
Organism:
Homo sapiens (Human)
Description:
Residue:
536
  
Inhibitor
Name:
BDBM50134222
Synonyms:
CHEMBL3741950
Type:
Small organic molecule
Emp. Form.:
C18H14BrFN4O
Mol. Mass.:
401.232
SMILES:
COc1cc(Br)cc2c1nc(C)c1c(C)nc(-c3cccnc3F)n21
: