Target
Glycogen synthase kinase-3 beta
Ligand
BDBM7287
Substrate
Meas. Tech.
ChEMBL_1545544 (CHEMBL3749459)
IC50
4±n/a nM
Citation
 Maqbool, MMobashir, MHoda, N Pivotal role of glycogen synthase kinase-3: A therapeutic target for Alzheimer's disease. Eur J Med Chem 107:63-81 (2015)  
Target
Name:
Glycogen synthase kinase-3 beta
Synonyms:
GSK-3 beta GSK3B Glycogen synthase kinase 3 beta (GSK3B) Glycogen synthase kinase-3 beta (GSK-3B) Glycogen synthase kinase-3 beta (GSK3B) Glycogen synthase kinase-3beta (GSK3B) | Serine/threonine-protein kinase GSK3B
Type:
Enzyme
Mol. Mass.:
46756.38
Organism:
Homo sapiens (Human)
Description:
P49841
Residue:
420
  
Inhibitor
Name:
BDBM7287
Synonyms:
8,18-diazatetracyclo[9.7.0.0^{2,7}.0^{12,17}]octadeca-1(11),2,4,6,12(17),13,15-heptaen-9-one NSC 641166 | Paullone
Type:
Small organic molecule
Emp. Form.:
C16H12N2O
Mol. Mass.:
248.2793
SMILES:
O=C1Cc2c([nH]c3ccccc23)-c2ccccc2N1
: