Target
Legumain
Ligand
BDBM50134277
Substrate
Meas. Tech.
ChEMBL_1543634 (CHEMBL3750895)
IC50
1459±n/a nM
Citation
 Ness, KAEddie, SLBurton, SHarrison, TMullan, PWilliams, R Flat SAR of P3-methylsulphonamide based small molecule legumain inhibitors. Bioorg Med Chem Lett 26:413-6 (2016)  
Target
Name:
Legumain
Synonyms:
3.4.22.34 LGMN PRSC1 | Protease, cysteine 1
Type:
Mol. Mass.:
49411.12
Organism:
Homo sapiens (Human)
Description:
Residue:
433
  
Inhibitor
Name:
BDBM50134277
Synonyms:
CHEMBL3747178
Type:
Small organic molecule
Emp. Form.:
C21H22F2N4O4S
Mol. Mass.:
464.486
SMILES:
C[C@@H](N(Cc1ccc(cc1)-c1cccc(F)c1F)S(C)(=O)=O)C(=O)N[C@@H](CC(N)=O)C#N
: