Target
Cholecystokinin receptor type A
Ligand
BDBM50380728
Substrate
Meas. Tech.
ChEMBL_1543656 (CHEMBL3751040)
IC50
105±n/a nM
Citation
 Desai, AJLam, PCOrry, AAbagyan, RChristopoulos, ASexton, PMMiller, LJ Molecular Mechanism of Action of Triazolobenzodiazepinone Agonists of the Type 1 Cholecystokinin Receptor. Possible Cooperativity across the Receptor Homodimeric Complex. J Med Chem 58:9562-77 (2015)  
Target
Name:
Cholecystokinin receptor type A
Synonyms:
CCK-A receptor CCK1-R CCKAR_HUMAN Cholecystokinin receptor Cholecystokinin-1 Receptor
Type:
G Protein-Coupled Receptor (GPCR)
Mol. Mass.:
47859.34
Organism:
Homo sapiens (Human)
Description:
Stable expression of human CCK-1 receptors in HEK 293 cells.
Residue:
428
  
Inhibitor
Name:
BDBM50380728
Synonyms:
CHEMBL2017835
Type:
Small organic molecule
Emp. Form.:
C40H39N7O2
Mol. Mass.:
649.7834
SMILES:
Cc1cc(C)cc(C[C@H]2CCCCN2C(=O)CN2c3ccccc3-n3c(nnc3-c3ccccc3)[C@H](Cc3n[nH]c4ccccc34)C2=O)c1
: