Target
Metabotropic glutamate receptor 3
Ligand
BDBM50134449
Substrate
Meas. Tech.
ChEMBL_1544992 (CHEMBL3749857)
EC50
34±n/a nM
Citation
 Conde-Ceide, SAlcázar, JAlonso de Diego, SALópez, SMartín-Martín, MLMartínez-Viturro, CMPena, MATong, HMLavreysen, HMackie, CBridges, TMDaniels, JSNiswender, CMJones, CKMacdonald, GJSteckler, TConn, PJStauffer, SRLindsley, CWBartolomé-Nebreda, JM Preliminary investigation of 6,7-dihydropyrazolo[1,5-a]pyrazin-4-one derivatives as a novel series of mGlu5 receptor positive allosteric modulators with efficacy in preclinical models of schizophrenia. Bioorg Med Chem Lett 26:429-34 (2016)  
Target
Name:
Metabotropic glutamate receptor 3
Synonyms:
GPRC1C GRM3_HUMAN metabotropic glutamate 3 metabotropic glutamate 3/1c
Type:
Enzyme Catalytic Domain
Mol. Mass.:
98889.09
Organism:
Homo sapiens (Human)
Description:
metabotropic glutamate 1c 0 HUMAN::Q14832
Residue:
879
  
Inhibitor
Name:
BDBM50134449
Synonyms:
CHEMBL3745812
Type:
Small organic molecule
Emp. Form.:
C19H15F2N3O2
Mol. Mass.:
355.3381
SMILES:
Fc1ccc(OCc2cc3C(=O)N(CCn3n2)c2ccc(F)cc2)cc1
: