Target
Prostaglandin G/H synthase 1
Ligand
BDBM50134547
Substrate
Meas. Tech.
ChEMBL_1543845 (CHEMBL3748424)
IC50
14600±n/a nM
Citation
 Abdellatif, KRAbdelall, EKFadaly, WAKamel, GM Synthesis, cyclooxygenase inhibition, anti-inflammatory evaluation and ulcerogenic liability of new 1,3,5-triarylpyrazoline and 1,5-diarylpyrazole derivatives as selective COX-2 inhibitors. Bioorg Med Chem Lett 26:406-12 (2016)  
Target
Name:
Prostaglandin G/H synthase 1
Synonyms:
COX1 Cyclooxygenase-1 (COX-1) PTGS1 | Prostaglandin G/H synthase (cyclooxygenase)
Type:
Protein
Mol. Mass.:
68868.60
Organism:
Ovis aries (Sheep)
Description:
Residue:
600
  
Inhibitor
Name:
BDBM50134547
Synonyms:
CHEMBL3747561
Type:
Small organic molecule
Emp. Form.:
C17H15N3O3S2
Mol. Mass.:
373.449
SMILES:
NS(=O)(=O)c1ccc(cc1)N1N=C(CC1c1ccco1)c1cccs1
: