Target
Prostaglandin G/H synthase 2
Ligand
BDBM50134572
Substrate
Meas. Tech.
ChEMBL_1543846 (CHEMBL3748425)
IC50
970±n/a nM
Citation
 Abdellatif, KRAbdelall, EKFadaly, WAKamel, GM Synthesis, cyclooxygenase inhibition, anti-inflammatory evaluation and ulcerogenic liability of new 1,3,5-triarylpyrazoline and 1,5-diarylpyrazole derivatives as selective COX-2 inhibitors. Bioorg Med Chem Lett 26:406-12 (2016)  
Target
Name:
Prostaglandin G/H synthase 2
Synonyms:
COX2 Cyclooxygenase 2 (COX-2) Cyclooxygenase-2 (COX-2 AA) Cyclooxygenase-2 (COX-2) PGH2_HUMAN PHS II Prostaglandin E synthase/G/H synthase 2 Prostaglandin-endoperoxide synthase 2
Type:
Enzyme
Mol. Mass.:
69003.89
Organism:
Homo sapiens (Human)
Description:
Recombinant Cox-2 provided by Cayman (Cayman Chemical Co.,Ann Arbor, MI).
Residue:
604
  
Inhibitor
Name:
BDBM50134572
Synonyms:
CHEMBL3746265
Type:
Small organic molecule
Emp. Form.:
C20H16F3N3O2S2
Mol. Mass.:
451.485
SMILES:
NS(=O)(=O)c1ccc(cc1)N1N=C(CC1c1ccc(cc1)C(F)(F)F)c1cccs1
: