Target
Carbonic anhydrase, alpha family
Ligand
BDBM10855
Substrate
Meas. Tech.
ChEMBL_1543854 (CHEMBL3749744)
Ki
546±n/a nM
Citation
 Vullo, DBhatt, AMahon, BPMcKenna, RSupuran, CT Sulfonamide inhibition studies of thea-carbonic anhydrase from the gammaproteobacterium Thiomicrospira crunogena XCL-2, TcruCA. Bioorg Med Chem Lett 26:401-5 (2016)  
Target
Name:
Carbonic anhydrase, alpha family
Synonyms:
Carbonic anhydrase, alpha family
Type:
PROTEIN
Mol. Mass.:
35831.01
Organism:
Thiomicrospira crunogena (strain XCL-2)
Description:
ChEMBL_109899
Residue:
315
  
Inhibitor
Name:
BDBM10855
Synonyms:
2-aminobenzene-1-sulfonamide US10172837, 2-aminobenzenesulfonamide orthanilamide 17
Type:
Small organic molecule
Emp. Form.:
C6H8N2O2S
Mol. Mass.:
172.205
SMILES:
Nc1ccccc1S(N)(=O)=O
: