Target
Carbonic anhydrase, alpha family
Ligand
BDBM10865
Substrate
Meas. Tech.
ChEMBL_1543854 (CHEMBL3749744)
Ki
810±n/a nM
Citation
 Vullo, DBhatt, AMahon, BPMcKenna, RSupuran, CT Sulfonamide inhibition studies of thea-carbonic anhydrase from the gammaproteobacterium Thiomicrospira crunogena XCL-2, TcruCA. Bioorg Med Chem Lett 26:401-5 (2016)  
Target
Name:
Carbonic anhydrase, alpha family
Synonyms:
Carbonic anhydrase, alpha family
Type:
PROTEIN
Mol. Mass.:
35831.01
Organism:
Thiomicrospira crunogena (strain XCL-2)
Description:
ChEMBL_109899
Residue:
315
  
Inhibitor
Name:
BDBM10865
Synonyms:
4-Amino-3-iodobenzenesulfonamide CHEMBL268177 halogenosulfanilamide deriv. 5e
Type:
Small organic molecule
Emp. Form.:
C6H7IN2O2S
Mol. Mass.:
298.101
SMILES:
Nc1ccc(cc1I)S(N)(=O)=O
: