Target
Carbonic anhydrase, alpha family
Ligand
BDBM10866
Substrate
Meas. Tech.
ChEMBL_1543854 (CHEMBL3749744)
Ki
67±n/a nM
Citation
 Vullo, DBhatt, AMahon, BPMcKenna, RSupuran, CT Sulfonamide inhibition studies of thea-carbonic anhydrase from the gammaproteobacterium Thiomicrospira crunogena XCL-2, TcruCA. Bioorg Med Chem Lett 26:401-5 (2016)  
Target
Name:
Carbonic anhydrase, alpha family
Synonyms:
Carbonic anhydrase, alpha family
Type:
PROTEIN
Mol. Mass.:
35831.01
Organism:
Thiomicrospira crunogena (strain XCL-2)
Description:
ChEMBL_109899
Residue:
315
  
Inhibitor
Name:
BDBM10866
Synonyms:
4-amino-6-(trifluoromethyl)benzene-1,3-disulfonamide aromatic/heteroaromatic sulfonamide 11
Type:
Small organic molecule
Emp. Form.:
C7H8F3N3O4S2
Mol. Mass.:
319.281
SMILES:
Nc1cc(c(cc1S(N)(=O)=O)S(N)(=O)=O)C(F)(F)F
: