Target
Carbonic anhydrase, alpha family
Ligand
BDBM10876
Substrate
Meas. Tech.
ChEMBL_1543854 (CHEMBL3749744)
Ki
21±n/a nM
Citation
 Vullo, DBhatt, AMahon, BPMcKenna, RSupuran, CT Sulfonamide inhibition studies of thea-carbonic anhydrase from the gammaproteobacterium Thiomicrospira crunogena XCL-2, TcruCA. Bioorg Med Chem Lett 26:401-5 (2016)  
Target
Name:
Carbonic anhydrase, alpha family
Synonyms:
Carbonic anhydrase, alpha family
Type:
PROTEIN
Mol. Mass.:
35831.01
Organism:
Thiomicrospira crunogena (strain XCL-2)
Description:
ChEMBL_109899
Residue:
315
  
Inhibitor
Name:
BDBM10876
Synonyms:
4-(hydroxymethyl)benzene-1-sulfonamide JMC522226 Compound 20 aromatic/heteroaromatic sulfonamide 21
Type:
Small organic molecule
Emp. Form.:
C7H9NO3S
Mol. Mass.:
187.216
SMILES:
NS(=O)(=O)c1ccc(CO)cc1
: