Target
Dual specificity mitogen-activated protein kinase kinase 3
Ligand
BDBM50134591
Substrate
Meas. Tech.
ChEMBL_1544298 (CHEMBL3751415)
IC50
4200±n/a nM
Citation
 Adams, MKobayashi, TLawson, JDSaitoh, MShimokawa, KBigi, SVHixon, MSSmith, CRTatamiya, TGoto, MRusso, JGrimshaw, CESwann, S Fragment-based drug discovery of potent and selective MKK3/6 inhibitors. Bioorg Med Chem Lett 26:1086-9 (2016)  
Target
Name:
Dual specificity mitogen-activated protein kinase kinase 3
Synonyms:
Dual specificity mitogen-activated protein kinase kinase 3 MAP2K3 MAPK/ERK kinase 3 (MEK3) MEK3 MP2K3_HUMAN SKK2
Type:
Protein
Mol. Mass.:
39321.50
Organism:
Homo sapiens (Human)
Description:
Residue:
347
  
Inhibitor
Name:
BDBM50134591
Synonyms:
CHEMBL3745744
Type:
Small organic molecule
Emp. Form.:
C12H11N3O
Mol. Mass.:
213.2352
SMILES:
NC(=O)c1nc(ccc1N)-c1ccccc1
: