Target
Glycylpeptide N-tetradecanoyltransferase 1
Ligand
BDBM50135490
Substrate
Meas. Tech.
ChEMBL_1549624 (CHEMBL3756684)
Ki
180±n/a nM
Citation
 Yu, ZBrannigan, JARangachari, KHeal, WPWilkinson, AJHolder, AALeatherbarrow, RJTate, EW Discovery of pyridyl-based inhibitors of Plasmodium falciparum N-myristoyltransferase. Medchemcomm 6:1767-1772 (2016)  
Target
Name:
Glycylpeptide N-tetradecanoyltransferase 1
Synonyms:
Myristoyl-CoA:protein N-myristoyltransferase (Nmt) NMT NMT1_HUMAN Peptide N-myristoyltransferase 1
Type:
Enzyme
Mol. Mass.:
56814.10
Organism:
Homo sapiens (Human)
Description:
P30419
Residue:
496
  
Inhibitor
Name:
BDBM50135490
Synonyms:
CHEMBL3753789
Type:
Small organic molecule
Emp. Form.:
C22H30N6O2
Mol. Mass.:
410.5126
SMILES:
CC(C)N1CCC(CC1)Oc1ncccc1-c1nc(Cc2c(C)nn(C)c2C)no1
: