Target
Proto-oncogene tyrosine-protein kinase receptor Ret
Ligand
BDBM50136226
Substrate
Meas. Tech.
ChEMBL_1547170 (CHEMBL3756073)
IC50
3±n/a nM
Citation
 Yoon, HKwak, YChoi, SCho, HKim, NDSim, T A Pyrazolo[3,4-d]pyrimidin-4-amine Derivative Containing an Isoxazole Moiety Is a Selective and Potent Inhibitor of RET Gatekeeper Mutants. J Med Chem 59:358-73 (2016)  
Target
Name:
Proto-oncogene tyrosine-protein kinase receptor Ret
Synonyms:
CDHF12 Cadherin family member 12 Proto-oncogene c-Ret RET51 Tyrosine-protein kinase Ret (RET)
Type:
Protein
Mol. Mass.:
124318.29
Organism:
Homo sapiens (Human)
Description:
P07949
Residue:
1114
  
Inhibitor
Name:
BDBM50136226
Synonyms:
CHEMBL3753341
Type:
Small organic molecule
Emp. Form.:
C14H16N6O
Mol. Mass.:
284.3164
SMILES:
CC(C)n1nc(-c2cc(on2)C2CC2)c2c(N)ncnc12
: