Target
Serine protease hepsin
Ligand
BDBM50135274
Substrate
Meas. Tech.
ChEMBL_1544367 (CHEMBL3748443)
Ki
3.4±n/a nM
Citation
 Kwon, HKim, YPark, KChoi, SASon, SHByun, Y Structure-based design, synthesis, and biological evaluation of Leu-Arg dipeptide analogs as novel hepsin inhibitors. Bioorg Med Chem Lett 26:310-4 (2016)  
Target
Name:
Serine protease hepsin
Synonyms:
HEPS_HUMAN Hepsin TMPRSS1 Transmembrane protease, serine 1
Type:
Enzyme
Mol. Mass.:
45016.98
Organism:
Homo sapiens (Human)
Description:
Human deglycosylated hepsin was expressed in Pichia pastoris.
Residue:
417
  
Inhibitor
Name:
BDBM50135274
Synonyms:
CHEMBL404190
Type:
Small organic molecule
Emp. Form.:
C21H30N6O3S
Mol. Mass.:
446.566
SMILES:
[#6]-[#6](-[#6])-[#6]-[#6@H](-[#7]-[#6](-[#6])=O)-[#6](=O)-[#7]-[#6@@H](-[#6]-[#6]-[#6]\[#7]=[#6](\[#7])-[#7])-[#6](=O)-c1nc2ccccc2s1
: