Target
Suppressor of tumorigenicity 14 protein homolog
Ligand
BDBM50135278
Substrate
Meas. Tech.
ChEMBL_1544368 (CHEMBL3748444)
Ki
>10000±n/a nM
Citation
 Kwon, HKim, YPark, KChoi, SASon, SHByun, Y Structure-based design, synthesis, and biological evaluation of Leu-Arg dipeptide analogs as novel hepsin inhibitors. Bioorg Med Chem Lett 26:310-4 (2016)  
Target
Name:
Suppressor of tumorigenicity 14 protein homolog
Synonyms:
Epithin ST14_MOUSE St14 | Suppressor of tumorigenicity 14 protein homolog
Type:
PROTEIN
Mol. Mass.:
94658.46
Organism:
Mus musculus
Description:
ChEMBL_116697
Residue:
855
  
Inhibitor
Name:
BDBM50135278
Synonyms:
CHEMBL3747693
Type:
Small organic molecule
Emp. Form.:
C19H35N5O6
Mol. Mass.:
429.5111
SMILES:
CC(C)C[C@H](NC(=O)[C@H](CCC(N)=O)NC(=O)[C@H](CCCCN)NC(C)=O)C(O)=O
: