Target
Cyclin-K
Ligand
BDBM50135286
Substrate
Meas. Tech.
ChEMBL_1546477 (CHEMBL3748668)
IC50
>10000±n/a nM
Citation
 Reddy, MVAkula, BJatiani, SVasquez-Del Carpio, RBilla, VKMallireddigari, MRCosenza, SCVenkata Subbaiah, DRBharathi, EVPallela, VRRamkumar, PJain, RAggarwal, AKReddy, EP Discovery of 2-(1H-indol-5-ylamino)-6-(2,4-difluorophenylsulfonyl)-8-methylpyrido[2,3-d]pyrimidin-7(8H)-one (7ao) as a potent selective inhibitor of Polo like kinase 2 (PLK2). Bioorg Med Chem 24:521-44 (2016)  
Target
Name:
Cyclin-K
Synonyms:
CCNK CPR4
Type:
PROTEIN
Mol. Mass.:
64254.10
Organism:
Homo sapiens (Human)
Description:
ChEMBL_107901
Residue:
580
  
Inhibitor
Name:
BDBM50135286
Synonyms:
CHEMBL3745885
Type:
Small organic molecule
Emp. Form.:
C22H15F2N5O3S
Mol. Mass.:
467.448
SMILES:
Cn1c2nc(Nc3ccc4[nH]ccc4c3)ncc2cc(c1=O)S(=O)(=O)c1ccc(F)cc1F
: