Target
Serine/threonine-protein kinase SIK3 [59-1321]
Ligand
BDBM50135286
Substrate
Meas. Tech.
ChEMBL_1543439 (CHEMBL3750158)
IC50
>10000±n/a nM
Citation
 Reddy, MVAkula, BJatiani, SVasquez-Del Carpio, RBilla, VKMallireddigari, MRCosenza, SCVenkata Subbaiah, DRBharathi, EVPallela, VRRamkumar, PJain, RAggarwal, AKReddy, EP Discovery of 2-(1H-indol-5-ylamino)-6-(2,4-difluorophenylsulfonyl)-8-methylpyrido[2,3-d]pyrimidin-7(8H)-one (7ao) as a potent selective inhibitor of Polo like kinase 2 (PLK2). Bioorg Med Chem 24:521-44 (2016)  
Target
Name:
Serine/threonine-protein kinase SIK3 [59-1321]
Synonyms:
KIAA0999 QSK SIK3 Salt-inducible kinase 3 Serine/threonine-protein kinase SIK3
Type:
PROTEIN
Mol. Mass.:
139984.87
Organism:
Homo sapiens (Human)
Description:
ChEMBL_774254
Residue:
1263
  
Inhibitor
Name:
BDBM50135286
Synonyms:
CHEMBL3745885
Type:
Small organic molecule
Emp. Form.:
C22H15F2N5O3S
Mol. Mass.:
467.448
SMILES:
Cn1c2nc(Nc3ccc4[nH]ccc4c3)ncc2cc(c1=O)S(=O)(=O)c1ccc(F)cc1F
: