Target
Aromatase
Ligand
BDBM50332824
Substrate
Meas. Tech.
ChEMBL_1547124 (CHEMBL3755859)
Ki
3.4±n/a nM
Citation
 Yadav, MRBarmade, MATamboli, RSMurumkar, PR Developing steroidal aromatase inhibitors-an effective armament to win the battle against breast cancer. Eur J Med Chem 105:1-38 (2015)  
Target
Name:
Aromatase
Synonyms:
ARO1 CP19A_HUMAN CYP19 CYPXIX Cytochrome P450 19A1 Cytochrome P450-C19 (CYP19) FL cytokine receptor precursor | P-450AROM
Type:
Enzyme
Mol. Mass.:
57888.92
Organism:
Homo sapiens (Human)
Description:
P11511
Residue:
503
  
Inhibitor
Name:
BDBM50332824
Synonyms:
(4S,8R,9S,10S,13S,14S)-4-hydroxy-10-(hydroxymethyl)-13-methyl-3,4,7,8,9,10,11,12,13,14,15,16-dodecahydro-1H-cyclopenta[alpha]phenanthren-17(2H)-one | CHEMBL1630274
Type:
Small organic molecule
Emp. Form.:
C19H28O3
Mol. Mass.:
304.4238
SMILES:
C[C@]12CC[C@H]3[C@@H](CC=C4[C@@H](O)CCC[C@]34CO)[C@@H]1CCC2=O
: